{"text_format":"1","workbook":"xlsx","n_sheets":8,"sheets":["Introduction","Calculator","Summary","ValQuals","ValUnits","ValCombs","ValDrops","For Info"],"not_rendered":{"charts":0,"images":4,"macros":1,"external_links":0,"defined_names":6,"comments":0,"pivot_tables":0},"unopened":[],"bounds":{"document_bytes":16777216,"sheet_cells":100000,"rows_first":2000,"rows_last":500,"rows_between":2000,"halvings":0,"cell_chars":16384,"cell_head_chars":4096},"cells_cut":0,"cells_raw":0,"read":"whole","date_system":"1900"}

{"sheet":"Introduction","index":0,"n_rows":20,"n_cols":5,"rows_kept":20,"cut":false,"hidden":false,"merged":[[8,1,8,11],[10,1,10,14],[14,4,14,13],[16,4,16,13],[19,4,19,13]]}
[]
[]
[]
[]
[]
[]
[]
[]
[null,"Introduction"]
[]
[null,"This calculator will help you to select the appropriate combination of 30, 60 or 90 GLH units for learners to undertake, to complete the chosen qualification route.  The calculator will ensure that you choose the correct amount of Guided Learning Hours (GLH) required, in the mandatory and optional sections of the qualification. The calculator will generate a clear table of the selected units, which can be printed out and included in your learners' portfolios or other records."]
[]
[null,"How to use this Qualification Calculator "]
[]
[null,null,"Step 1:",null,"The Instructions in the top left of the Calculator screen will explain what you need to do. Please note, if you select Foundation Diploma or Diploma you will see additional Pathway options."]
[]
[null,null,"Step 2:",null,"Select the appropriate units using the tick boxes. If you need to re-start your selection, click on the Reset button. Once you have selected the appropriate units you can then move onto the Summary page."]
[]
[]
[null,null,"Step 3:",null,"Click on the Unit Summary button to see your selection in a printable format."]

{"sheet":"Calculator","index":1,"n_rows":61,"n_cols":42,"rows_kept":61,"cut":false,"hidden":false,"merged":[[42,41,42,44],[43,41,43,44],[44,41,44,44],[45,41,45,44],[26,4,26,17],[28,4,28,17],[41,18,41,20],[37,22,38,22],[38,41,38,44],[39,41,39,44],[40,41,40,44],[41,41,41,44],[26,19,27,24],[28,19,28,24],[42,18,42,22],[43,19,43,21],[8,1,8,20],[36,18,36,22],[37,18,37,20],[38,18,38,20],[39,18,39,20],[26,1,26,3],[28,1,28,3],[37,2,37,5],[30,4,32,17],[33,4,35,17],[37,23,38,25],[39,23,40,25],[41,23,41,25],[40,18,40,20],[58,2,58,5],[56,2,56,5],[57,2,57,5],[50,2,50,5],[51,2,51,5],[52,2,52,5],[53,2,53,5],[54,2,54,5],[55,2,55,5],[49,2,49,5],[38,2,38,5],[39,2,39,5],[47,2,47,5],[48,2,48,5],[44,2,44,5],[45,2,45,5],[40,2,40,5],[41,2,41,5],[42,2,42,5],[43,2,43,5],[46,2,46,5]]}
[]
[]
[]
[]
[]
[]
[]
[]
[null,"Calculator"]
[]
[]
[]
[]
[]
[]
[]
[]
[]
[]
[]
[]
[]
[]
[]
[]
[]
[null,"Required qualification:",null,null,"SELECT QUALIFICATION HERE",null,null,null,null,null,null,null,null,null,null,null,null,null,{"$f":"IF(AO39=3,\"PATHWAY\",IF(AO39=4,\"PATHWAY2\",\"\"))","v":""},{"$f":"IFERROR(IF(E27=\"SELECT QUALIFICATION HERE\",\"\",IF(AO41=0,\"\",INDEX(ValCombs!N10:N24,(MATCH(AO41,ValCombs!M10:M24,0))))),\"\")","v":""}]
[]
[null,"Required pathway:",null,null,"SELECT PATHWAY HERE"]
[]
{"$rows_left_out":32}
{"sheet":"Summary","index":2,"n_rows":42,"n_cols":11,"rows_kept":42,"cut":false,"hidden":false,"merged":[[13,1,13,4],[13,5,13,10],[7,1,7,11],[8,1,8,10],[10,1,10,10],[12,1,12,4],[12,5,12,10],[20,2,20,9],[14,1,14,4],[14,5,14,10],[15,1,15,4],[15,5,15,10],[16,1,16,4],[16,5,16,6],[17,1,17,4],[17,5,17,6],[16,7,17,10],[32,2,32,9],[21,2,21,9],[22,2,22,9],[23,2,23,9],[24,2,24,9],[25,2,25,9],[26,2,26,9],[27,2,27,9],[28,2,28,9],[29,2,29,9],[30,2,30,9],[31,2,31,9],[41,2,41,9],[39,2,39,9],[40,2,40,9],[33,2,33,9],[34,2,34,9],[35,2,35,9],[36,2,36,9],[37,2,37,9],[38,2,38,9]]}
[]
[]
[]
[]
[]
[]
[]
[null,"OCR Cambridge Technical in Sport and Physical Activity Level 3"]
[null,{"$f":"Calculator!E27","v":"SELECT QUALIFICATION HERE"}]
[null,{"$f":"IF(Calculator!E29=\"SELECT PATHWAY HERE\",\"\",Calculator!E29)","v":""}]
[null,"Summary Sheet"]
[]
[null,"Learner's Name:"]
[null,"Tutor's Name:"]
[null,"Centre Name:"]
[null,"Centre Number:"]
[null,"Guided Learning Hours (GLH) Required:",null,null,null,{"$f":"Calculator!V38","v":0}]
[null,"Guided Learning Hours (GLH) Selected:",null,null,null,{"$f":"Calculator!V39","v":0}]
[null,"Selected units:"]
[]
[null,"Unit No.","Unit Title",null,null,null,null,null,null,null,"GLH"]
[null,1,{"$f":"ValUnits!C13","v":"Body systems and the effects of physical activity"},"Body systems and the effects of physical activity","Body systems and the effects of physical activity","Body systems and the effects of physical activity","Body systems and the effects of physical activity","Body systems and the effects of physical activity","Body systems and the effects of physical activity","Body systems and the effects of physical activity",{"$f":"ValUnits!D13","v":90}]
[null,2,{"$f":"ValUnits!C14","v":"Sports coaching and activity leadership"},"Body systems and the effects of physical activity","Body systems and the effects of physical activity","Body systems and the effects of physical activity","Body systems and the effects of physical activity","Body systems and the effects of physical activity","Body systems and the effects of physical activity","Body systems and the effects of physical activity",{"$f":"ValUnits!D14","v":90}]
[null,3,{"$f":"ValUnits!C15","v":"Sports organisation and development"},"Body systems and the effects of physical activity","Body systems and the effects of physical activity","Body systems and the effects of physical activity","Body systems and the effects of physical activity","Body systems and the effects of physical activity","Body systems and the effects of physical activity","Body systems and the effects of physical activity",{"$f":"ValUnits!D15","v":60}]
[null,4,{"$f":"ValUnits!C16","v":"Working safely in sport, exercise, health and leisure"},"Body systems and the effects of physical activity","Body systems and the effects of physical activity","Body systems and the effects of physical activity","Body systems and the effects of physical activity","Body systems and the effects of physical activity","Body systems and the effects of physical activity","Body systems and the effects of physical activity",{"$f":"ValUnits!D16","v":90}]
[null,5,{"$f":"ValUnits!C17","v":"Performance analysis in sport and exercise"},"Body systems and the effects of physical activity","Body systems and the effects of physical activity","Body systems and the effects of physical activity","Body systems and the effects of physical activity","Body systems and the effects of physical activity","Body systems and the effects of physical activity","Body systems and the effects of physical activity",{"$f":"ValUnits!D17","v":60}]
[null,6,{"$f":"ValUnits!C18","v":"Group exercise to music"},"Body systems and the effects of physical activity","Body systems and the effects of physical activity","Body systems and the effects of physical activity","Body systems and the effects of physical activity","Body systems and the effects of physical activity","Body systems and the effects of physical activity","Body systems and the effects of physical activity",{"$f":"ValUnits!D18","v":60}]
[null,7,{"$f":"ValUnits!C19","v":"Improving fitness for sport and physical activity"},"Body systems and the effects of physical activity","Body systems and the effects of physical activity","Body systems and the effects of physical activity","Body systems and the effects of physical activity","Body systems and the effects of physical activity","Body systems and the effects of physical activity","Body systems and the effects of physical activity",{"$f":"ValUnits!D19","v":60}]
[null,8,{"$f":"ValUnits!C20","v":"Organisation of sports events"},"Body systems and the effects of physical activity","Body systems and the effects of physical activity","Body systems and the effects of physical activity","Body systems and the effects of physical activity","Body systems and the effects of physical activity","Body systems and the effects of physical activity","Body systems and the effects of physical activity",{"$f":"ValUnits!D20","v":60}]
[null,9,{"$f":"ValUnits!C21","v":"Unused"},"Body systems and the effects of physical activity","Body systems and the effects of physical activity","Body systems and the effects of physical activity","Body systems and the effects of physical activity","Body systems and the effects of physical activity","Body systems and the effects of physical activity","Body systems and the effects of physical activity",{"$f":"ValUnits!D21","v":0}]
{"$rows_left_out":13}
{"sheet":"ValQuals","index":3,"n_rows":18,"n_cols":10,"rows_kept":18,"cut":false,"hidden":true,"merged":[[3,1,3,9]]}
[]
[null,"Validation Page - Qualification"]
[]
[null,"The table below outlines the structure of the qualifications covered by this Qualifications Calculater. Changes made on this page will perculate through the other pages of this QC. DO NOT CHANGE any data on this page, unless you are sure about the implications."]
[]
[null,"Qualification Look Up Table"]
[null,"Space has been left in the table for later changes or additions to the qualifications."]
[]
[null,"Qualification Name","Total   GLH","Total Units Required","No. of Mandatory Units","GLH from Mandatory Units","No. of PO Units","GLH from PO Units","Max GLH from O* Units ","Qual Code"]
[null,"SELECT QUALIFICATION HERE",null,null,null,null,null,null,null,0]
[null,"Level 3 Cambridge Technical Certificate in Sport and Physical Activity",180,2,2,180,0,0,0,1]
[null,"Level 3 Cambridge Technical Extended Certificate in Sport and Physical Activity",360,5,3,240,0,0,0,2]
[]
[null,"Level 3 Cambridge Technical Foundation Diploma in Sport and Physical Activity",540,null,"6 / 7",540,0,0,0,3]
[]
[null,"Level 3 Cambridge Technical Diploma in Sport and Physical Activity",720,10,8,720,0,0,0,4]
[]
[null,"Level 3 Cambridge Technical Extended Diploma in Sport and Physical Activity Development",1080,null,13,840,0,0,0,6]

{"sheet":"ValUnits","index":4,"n_rows":47,"n_cols":40,"rows_kept":47,"cut":false,"hidden":true,"merged":[[11,5,11,18],[10,22,10,39],[3,1,3,12],[6,1,6,12]]}
[]
[null,"Validation Page - Units"]
[]
[null,"The table below outlines the structure of the units for each qualifications covered by this Qualifications Calculater. Changes made on this page will perculate through the other pages of this QC. DO NOT CHANGE any data on this page, unless you are sure about the implications."]
[]
[null,"Units Look Up Table"]
[null,"Space has been left in the table for later changes or additions to the qualifications. To help identify any errors in the data table, see the Error Trapping Table to the right of the main table, below."]
[]
[]
[null,null,null,null,null,"Level 3 Cambridge Technical Certificate in Sport and Physical Activity","Level 3 Cambridge Technical Extended Certificate in Sport and Physical Activity",null,"Level 3 Cambridge Technical Foundation Diploma in Sport and Physical Activity","Level 3 Cambridge Technical Foundation Diploma in Sport and Physical Activity","Level 3 Cambridge Technical Foundation Diploma in Sport and Physical Activity",null,"Level 3 Cambridge Technical Diploma in Sport and Physical Activity","Level 3 Cambridge Technical Diploma in Sport and Physical Activity",null,"Level 3 Cambridge Technical Extended Diploma in Sport and Physical Activity Development","Level 3 Cambridge Technical Extended Diploma in Sport and Physical Activity"]
[null,null,null,null,"Pathways","N/A","N/A",null,"Activity Leadership","Fitness Instructing","Recreational Assistant",null,"Sports Coaching","Personal Training",null,"N/A","Sport Science",null,null,null,null,null,"Error Trapping Table - the table below will help to identify where data is missing or may be incorrect in the main table. If any notes appear in this table check the corresponding cell in the main table for possible errors."]
[null,"Unit No.","Unit Name","GLH","Assessment Type","Pathway Unit Types",null,null,null,null,null,null,null,null,null,null,null,null,null,null,null,null,"B","C","D","E","F","G","H","I","J","K","L","M","N","O","P","Q","R","S"]
[null,1,"Body systems and the effects of physical activity",90,"External","M","M",null,"M","M","M",null,"M","M",null,"M","M",null,null,null,null,13,"",null,"",null,"","","Missing","","Missing","","","Missing","","Missing","Missing","Missing","Missing","Missing"]
[null,2,"Sports coaching and activity leadership",90,"Internal","M","M",null,"M","M","M",null,"M","M",null,"M","M",null,null,null,null,14,"",null,"",null,"","","Missing","","Missing","","","Missing","","Missing","Missing","Missing","Missing","Missing"]
[null,3,"Sports organisation and development",60,"External","---","M",null,"M","M","M",null,"M","M",null,"M","M",null,null,null,null,15,"",null,"",null,"","","Missing","","Missing","","","Missing","","Missing","Missing","Missing","Missing","Missing"]
[null,4,"Working safely in sport, exercise, health and leisure",90,"External","---","---",null,"M","M","M",null,"M","M",null,"M","M",null,null,null,null,16,"",null,"",null,"","","Missing","","Missing","","","Missing","","Missing","Missing","Missing","Missing","Missing"]
[null,5,"Performance analysis in sport and exercise",60,"Internal","---","O",null,"---","---","---",null,"M","---",null,"M","M",null,null,null,null,17,"",null,"",null,"","","Missing","","Missing","","","Missing","","Missing","Missing","Missing","Missing","Missing"]
[null,6,"Group exercise to music",60,"Internal","---","---",null,"---","M","---",null,"---","M",null,"O","O",null,null,null,null,18,"",null,"",null,"","","Missing","","Missing","","","Missing","","Missing","Missing","Missing","Missing","Missing"]
[null,7,"Improving fitness for sport and physical activity",60,"Internal","---","---",null,"---","---","---",null,"---","M",null,"M","M",null,null,null,null,19,"",null,"",null,"","","Missing","","Missing","","","Missing","","Missing","Missing","Missing","Missing","Missing"]
[null,8,"Organisation of sports events",60,"Internal","---","O",null,"O","---","M",null,"M","---",null,"M","---",null,null,null,null,20,"",null,"",null,"","","Missing","","Missing","","","Missing","","Missing","Missing","Missing","Missing","Missing"]
[null,9,"Unused",null,null,"---","---",null,"---","---","---",null,"---","---",null,"---","---",null,null,null,null,21,"",null,"",null,"","","Missing","","Missing","","","Missing","","Missing","Missing","Missing","Missing","Missing"]
[null,10,"Biomechanics and movement analysis",60,"Internal","---","O",null,"---","---","---",null,"O","O",null,"O","M",null,null,null,null,22,"",null,"",null,"","","Missing","","Missing","","","Missing","","Missing","Missing","Missing","Missing","Missing"]
[null,11,"Physical activity for specific groups",30,"Internal","---","O",null,"M","M","M",null,"M","M",null,"M","M",null,null,null,null,23,"",null,"",null,"","","Missing","","Missing","","","Missing","","Missing","Missing","Missing","Missing","Missing"]
[null,12,"Nutrition and diet for sport and exercise",30,"Internal","---","O",null,"O","O","O",null,"O","O",null,"M","M",null,null,null,null,24,"",null,"",null,"","","Missing","","Missing","","","Missing","","Missing","Missing","Missing","Missing","Missing"]
[null,13,"Health and fitness testing for sport and exercise",60,"Internal","---","---",null,"---","O","---",null,"O","M",null,"O","M",null,null,null,null,25,"",null,"",null,"","","Missing","","Missing","","","Missing","","Missing","Missing","Missing","Missing","Missing"]
[null,14,"Working in active leisure facilities",60,"Internal","---","---",null,"---","---","M",null,"---","---",null,"M","---",null,null,null,null,26,"",null,"",null,"","","Missing","","Missing","","","Missing","","Missing","Missing","Missing","Missing","Missing"]
[null,15,"Unused",null,null,"---","---",null,"---","---","---",null,"---","---",null,"---","---",null,null,null,null,27,"",null,"",null,"","","Missing","","Missing","","","Missing","","Missing","Missing","Missing","Missing","Missing"]
[null,16,"Unused",null,null,"---","---",null,"---","---","---",null,"---","---",null,"---","---",null,null,null,null,28,"",null,"",null,"","","Missing","","Missing","","","Missing","","Missing","Missing","Missing","Missing","Missing"]
[null,17,"Sports injuries and rehabilitation",60,"Internal","---","O",null,"O","O","O",null,"M","O",null,"M","M",null,null,null,null,29,"",null,"",null,"","","Missing","","Missing","","","Missing","","Missing","Missing","Missing","Missing","Missing"]
[null,18,"Practical skills in sport and physical activities",60,"Internal","---","O",null,"O","O","O",null,"M","---",null,"M","O",null,null,null,null,30,"",null,"",null,"","","Missing","","Missing","","","Missing","","Missing","Missing","Missing","Missing","Missing"]
{"$rows_left_out":18}
{"sheet":"ValCombs","index":5,"n_rows":24,"n_cols":16,"rows_kept":24,"cut":false,"hidden":true,"merged":[[3,1,3,13]]}
[]
[null,"Validation Page - Combinations"]
[]
[null,"The table below outlines the possible qualification and pathway combinations that are available for the qualifications covered by this Qualifications Calculater. Changes made on this page will perculate through the other pages of this QC. DO NOT CHANGE any data on this page, unless you are sure about the implications."]
[]
[null,"Combinations Look Up Table"]
[null,"Space has been left in the table for later changes or additions to the qualifications."]
[]
[null,"Qualification Name","Pathway","Total   GLH","Total Units Required","No. of Mandatory Units","GLH from Mandatory Units","No. of PO Units","GLH from PO Units","Max GLH from O* Units ","Qual Code","Path Code","Comb Code","Descriptive Statement","Calculator Table Column Letter","No. of Mand Units in words"]
[null,"SELECT QUALIFICATION HERE","SELECT PATHWAY HERE",null,null,null,null,null,null,null,0,15,{"$f":"K10*L10","v":0}]
[null,"Level 3 Cambridge Technical Certificate in Sport and Physical Activity",null,180,2,2,120,0,0,0,1,15,{"$f":"K11*L11","v":15},{"$f":"CONCATENATE(\"For this qualification learners must achieve an appropriate combination of 30, 60 and 90 GLH units, totalling \",D11,\" GLH (\",P11,\" of which are mandatory.)\")","v":"For this qualification learners must achieve an appropriate combination of 30, 60 and 90 GLH units, totalling 180 GLH (two of which are mandatory.)"},"H","two"]
[null,"Level 3 Cambridge Technical Extended Certificate in Sport and Physical Activity",null,360,5,3,240,0,0,0,2,15,30,{"$f":"CONCATENATE(\"For this qualification learners must achieve an appropriate combination of 30, 60 and 90 GLH units, totalling \",D12,\" GLH (\",P12,\" of which are mandatory.)\")","v":"For this qualification learners must achieve an appropriate combination of 30, 60 and 90 GLH units, totalling 360 GLH (three of which are mandatory.)"},"I","three"]
[null,"Level 3 Cambridge Technical Foundation Diploma in Sport and Physical Activity","Activity Leadership",540,null,5,360,0,0,0,3,25,75,"For this qualification learners must achieve an appropriate combination of 30, 60 and 90 GLH units, totalling 540 GLH (five of which are mandatory.)","J","five"]
[null,"Level 3 Cambridge Technical Foundation Diploma in Sport and Physical Activity","Fitness Instructing",540,null,6,420,0,0,0,3,35,105,"For this qualification learners must achieve an appropriate combination of 30, 60 and 90 GLH units, totalling 540 GLH (six of which are mandatory.)","K","six"]
[null,"Level 3 Cambridge Technical Foundation Diploma in Sport and Physical Activity","Recreational Assistant",540,null,7,480,0,0,0,3,45,135,"For this qualification learners must achieve an appropriate combination of 30, 60 and 90 GLH units, totalling 540 GLH (seven of which are mandatory.)","L","seven"]
[null,"Level 3 Cambridge Technical Diploma in Sport and Physical Activity","Sports Coaching",720,null,9,600,0,0,0,4,55,220,"For this qualification learners must achieve an appropriate combination of 30, 60 and 90 GLH units, totalling 720 GLH (nine of which are mandatory.)","M","nine"]
[null,"Level 3 Cambridge Technical Diploma in Sport and Physical Activity","Personal Training",720,null,8,540,0,0,0,4,65,260,"For this qualification learners must achieve an appropriate combination of 30, 60 and 90 GLH units, totalling 720 GLH (eight of which are mandatory.)","N","eight"]
[null,null,null,null,null,null,null,null,null,null,null,null,null,null,"O"]
[null,"Level 3 Cambridge Technical Extended Diploma in Sport and Physical Activity Development",null,1080,15,13,840,0,0,0,6,15,90,{"$f":"CONCATENATE(\"For this qualification learners must achieve an appropriate combination of 30, 60 and 90 GLH units, totalling \",D19,\" GLH (\",P19,\" of which are mandatory.)\")","v":"For this qualification learners must achieve an appropriate combination of 30, 60 and 90 GLH units, totalling 1080 GLH (thirteen of which are mandatory.)"},"P","thirteen"]
[null,null,null,null,null,null,null,null,null,null,null,null,null,null,"Q"]
[null,null,null,null,null,null,null,null,null,null,null,null,null,null,"R"]
[null,null,null,null,null,null,null,null,null,null,null,null,null,null,"S"]
[null,null,null,null,null,null,null,null,null,null,null,null,null,null,"T"]
[null,null,null,null,null,null,null,null,null,null,null,null,null,null,"U"]

{"sheet":"ValDrops","index":6,"n_rows":19,"n_cols":12,"rows_kept":19,"cut":false,"hidden":true,"merged":[[14,1,16,1],[17,3,19,3],[15,7,17,7],[18,5,20,5],[3,1,3,12]]}
[]
[null,"Validation Page - Dropdowns"]
[]
[null,"This page defines the dropdown lists used on various pages of the Qualifications Calculater. Changes made on this page will perculate through the other pages of this QC. DO NOT CHANGE any data on this page, unless you are sure about the implications."]
[]
[null,"Drowdown Lists"]
[null,"Each list has a descriptive name, its defined NAME within this workbook, a reference to where it is used and the list items. Dependent lists are indicated by an arrow between them."]
[]
[null,"Assessment Type",null,"Unit Types",null,"Qualifications Available",null,"Pathways Available",null,"Pathways Available",null,"Pathways Available"]
[null,"ASSTYPE",null,"UNITTYPE",null,"QUALS",null,"PATHWAY",null,"PATHWAY2",null,"PATHWAY3"]
[null,"External",null,"M",null,"SELECT QUALIFICATION HERE",null,"SELECT PATHWAY HERE",null,"SELECT PATHWAY HERE",null,"SELECT PATHWAY HERE"]
[null,"Internal",null,"PO",null,"Level 3 Cambridge Technical Certificate in Sport and Physical Activity",null,"Activity Leadership",null,"Sports Coaching",null,"Sport Studies"]
[null,null,null,"O",null,"Level 3 Cambridge Technical Extended Certificate in Sport and Physical Activity",null,"Fitness Instructing",null,"Personal Training",null,"Sport Science"]
[null,null,null,"O*",null,"Level 3 Cambridge Technical Foundation Diploma in Sport and Physical Activity",null,"Recreational Assistant"]
[null,"Used within the Units Look-up Table on the ValUnits page.",null,"---",null,"Level 3 Cambridge Technical Diploma in Sport and Physical Activity"]
[null,null,null,null,null,"Level 3 Cambridge Technical Extended Diploma in Sport and Physical Activity Development",null,"Used on the Calculator Page to select the Pathway"]
[]
[null,null,null,"Used within the Units Look-up Table on the ValUnits page."]
[null,null,null,null,null,"Used on the Calculator Page to select the qualification type"]

{"sheet":"For Info","index":7,"n_rows":13,"n_cols":6,"rows_kept":13,"cut":false,"hidden":true,"merged":[]}
[]
[null,"For Information"]
[]
[]
[null,"Main Colour",null,"Calculator Hidden Table Ref","Column","Rows"]
[null,"28 : 63 : 119",null,"Mandatory Unit Flags","AJ"]
[null,null,null,"PO Unit Flags","AM"]
[null,"Highlight Colour",null,"Unavailable Unit Flags","AP"]
[null,"168 : 193 : 234",null,"Select Units (True/False)","AI"]
[]
[null,"Second Highlight Colour",null,"Unit Type Columns","H:U"]
[null,"211 : 224 : 245",null,"No. Mandatory Unite Requ","AT"]
[null,null,null,"Summary Table ","AA"]